navn i noark
type: AnnotationProperty
range: string

arkivskaper
type: ObjectProperty
sub property of: rolle
navn i noark: M006 - arkivskaperID
alternative label: dataprodusent
definition: En agent som skaper arkiv som ledd i sin virksomhet.

avgiver
type: ObjectProperty
sub property of: rolle
definition: Rolle som har rett til og ansvaret for å overføre arkivpakke til en bevaringsinstitusjon og som er avtalepart med bevaringsinstitusjonen i overføringsavtale.

bevaringsinstitusjon
type: ObjectProperty
sub property of: rolle
definition: Virksomhet som tar vare på og gjør tilgjengelig bevaringsverdige arkivdata på egne eller andres vegne.

databehandler
type: ObjectProperty
sub property of: rolle
alternative label: forvalter
definition: En agent som forvalter arkivdata, og den som kan behandle personopplysninger på oppdrag fra den behandlingsansvarlige. Dette er vanligvis en virksomhet.

datakonsument
type: ObjectProperty
sub property of: rolle
definition: Den som innhenter eller mottar data fra andre aktører.

endrer
type: ObjectProperty
sub property of: topObjectProperty
domain: Arkivdata
range: Arkivdata
definition: Arkivdata som er endret av arkivdata gjennom en hendelse.

er en del av
type: ObjectProperty
sub property of: topObjectProperty
domain: Arkivdata
range: Arkivdata
definition: Arkivdata som er en del av arkivdata.
example: Dokument --er en del av--> Mappe --er en del av--> Stykke --er en del av--> Boks --er en del av--> Serie --er en del av--> Arkiv

er knyttet til konsept
type: ObjectProperty
domain: Påstand
range: Thing
definition: Et konsept som ytterligere beskrivelse av påstanden. Fortrinnsvis fra hhv. Wikidata eller DBPedia, eventuelt andre relevante RDF-baser.
example: URI til Wikidatas beskrivelse av kong Haakon VII: https://www.wikidata.org/wiki/Q154927

er skapt i system
type: ObjectProperty
sub property of: topObjectProperty
domain: Arkivdata
range: Programvare
definition: Programvare (Software) hvor arkivdata er skapt.

geografi
type: ObjectProperty
sub property of: topObjectProperty
domain: Arkivdata
range: Geografi
definition: Geografisk lokasjon hvor arkivdata er skapt.
scope note: Verdien SKAL velges fra EUs kontrollerte vokabularer Continent, Countries and territories eller Place, HVIS den finnes på listene; GeoNames SKAL i andre tilfeller brukes. Norsk utvidelse: For å angi dekningsområde i Norge, BØR Kartverkets kontrollerte vokabular Administrative enheter brukes i tillegg (https://www.geonorge.no).

har blitt representasjonstype
type: ObjectProperty
sub property of: topObjectProperty
domain: Konvertering
range: Representasjonstype
definition: Konverteringen har resultert i en ny representasjonstype.

har dokumenttype
type: ObjectProperty
sub property of: topObjectProperty
domain: Arkivdata
range: Dokumenttype
definition: Arkivdataens dokumenttype.
preferred label: has document type @en

har formål
type: ObjectProperty
sub property of: topObjectProperty
domain: Arkivdata
range: Formål
definition: Aktiviteten som resulterte i arkivdataen.

har hendelsestype
type: ObjectProperty
sub property of: topObjectProperty
domain: Hendelse
range: Hendelsestype
definition: Angir hendelsens art.

har hjemmel
type: ObjectProperty
sub property of: topObjectProperty
domain: Formål
domain: Restriksjon
range: Lov og forskrift
definition: Regelverk som hjemler formål og restriksjon.

har konvertering
type: ObjectProperty
sub property of: topObjectProperty
domain: Arkivdata
range: Konvertering
definition: Konvertering av arkivdata.

har lokasjon
type: ObjectProperty
sub property of: topObjectProperty
domain: Arkivdata
range: Lokasjon
definition: Den bestemte lokasjonen til arkivdata eller en aktør.

har ordning
type: ObjectProperty
sub property of: topObjectProperty
domain: Arkivdata
domain: Konvertering
range: Ordning
navn i noark: M086 - klassifikasjonstype
definition: Arkivdataens ordning.

har representasjonstype
type: ObjectProperty
sub property of: topObjectProperty
domain: Arkivdata
range: Representasjonstype
definition: Representasjonstypen arkivdataen har.

har språk
type: ObjectProperty
domain: Arkivdata
range: Språk
definition: Arkivdataens språk.
scope note: Verdien SKAL velges fra EUs kontrollerte vokabular Language (ISO 639).

har standard
type: ObjectProperty
sub property of: topObjectProperty
domain: Programvare
domain: Ordning
range: Standard
definition: Refererer til en implementasjonsregel eller annen spesifikasjon som ligger til grunn for ordning eller programvare.

har tilgang
type: ObjectProperty
domain: Arkivdata
range: Tilgang
definition: Tilgang til arkivdata.

er transkribert
type: ObjectProperty
sub property of: topObjectProperty
domain: Arkivdata
range: Transkribert
definition: Egenskapen peker til utfyllende transkriberingsinformasjon for arkivdata.

har vært representasjonstype
type: ObjectProperty
sub property of: topObjectProperty
domain: Konvertering
range: Representasjonstype
definition: Arkivdataens representasjonstype før konvertering.

er instans av
type: ObjectProperty
sub property of: topObjectProperty
domain: Arkivdata
range: Arkivdata
alternative label: representasjon av
definition: Arkivdata som er instans av arkivdata.
example: Brevet "Kongens Nei" har to instanser; "Kongens Nei - Digital" og "Kongens Nei - Analog". Ved å ha en abstrakt representasjon av brevet "Kongens Nei" og to konkrete representasjoner "Kongens Nei - Digital" og "Kongens Nei - Analog" gir det rom for å skille metadata som er knyttet til hhv. digital og analog representasjon, samt at vi bevarer metadata som er felles gjennom en abstrakt representasjon hvor alle er tett forbundet med relasjonen _er instans av_. "Kongens Nei - Digital" --er instans av --> "Kongens Nei", "Kongens Nei - Analog" --er instans av --> "Kongens Nei".
scope note: Relasjonen benyttes der det eksisterer en analog og digital instans av samme arkivdata.

konvertering utført av
type: ObjectProperty
sub property of: topObjectProperty
domain: Konvertering
range: Aktør
definition: Konvertering utført av en aktør.

konverteringsstatus
type: ObjectProperty
sub property of: topObjectProperty
domain: Konvertering
range: Konverteringsstatus
definition: Statusen på en konvertering, er den digitisert eller mediekonvertert.

overføringsmetode
type: ObjectProperty
domain: Overføringsmetode
range: Programvare
definition: Programvare benyttet for overføring av arkivdata.

påstandens avsender
type: ObjectProperty
sub property of: topObjectProperty
domain: Påstand
range: Aktør
definition: En påstand fremmes alltid av en aktør.

relatert til
type: ObjectProperty
sub property of: topObjectProperty
domain: Arkivdata
range: Arkivdata
definition: Relasjon mellom to arkivdata.
scope note: Relasjon som benyttes der "endrer", "er en del av" eller "er instans av" ikke passer, men det likevel skal være en relasjon mellom to arkivdata.

rolle
type: ObjectProperty
sub property of: topObjectProperty
domain: Arkivdata
range: Aktør
definition: Samlebetegnelse for alle rolletyper mellom arkivdata og aktør.

råderettshaver
type: ObjectProperty
sub property of: rolle
alternative label: behandlingsansvarlig
definition: En agent som har råderett over arkivdataen, og den som bestemmer formålet med behandlingen av personopplysninger og hvilke hjelpemidler som skal brukes. Dette er vanligvis en virksomhet.

tjenesteleverandør
type: ObjectProperty
sub property of: rolle
definition: Den som selger eller leverer tjenester, systemer eller lignende. Tjenesteleverandører vil normalt representere en behandlingsansvarlig og også ha rollen som databehandler.

BK-vedtaksnummer
type: DatatypeProperty
sub property of: identifikatorer
domain: Arkivdata
range: string
definition: Vedtaksnummer fra bevarings- og kassasjonsregisteret.

arkivdigitaliserings id
type: DatatypeProperty
sub property of: identifikatorer
domain: Arkivdata
range: string
definition: Entydig identifikator fra bakom/arkivdigitalisering.

asta id
type: DatatypeProperty
sub property of: identifikatorer
domain: Arkivdata
range: string
definition: Objekt-ID (UUID) fra Asta.

avleveringssak
type: DatatypeProperty
sub property of: identifikatorer
domain: Arkivdata
range: string
definition: Saksnummer til saken hvor avtale for avlevering.

beskrivelse
type: DatatypeProperty
sub property of: topDataProperty
domain: Thing
range: langString
definition: En tekstlig beskrivelse av et individ.
example: Innholdsbeskrivelse av vilkårlig arkivdata eller tekstlig beskrivelse av oppdaget objekt i medium.

betty
type: DatatypeProperty
sub property of: identifikatorer
domain: Arkivdata
range: string
definition: ID fra Betty

bevarings id
type: DatatypeProperty
sub property of: identifikatorer
domain: Arkivdata
range: string
definition: Datasett ID (UUID) fra Bevaring.

dato fra
type: DatatypeProperty
sub property of: topDataProperty
domain: Arkivdata
range: dateTime
navn i noark: M107 - arkivperiodeStartDato
alternative label: startdato ytterår
definition: Startdato for informasjonen i arkivdata.

dato til
type: DatatypeProperty
sub property of: topDataProperty
domain: Arkivdata
range: dateTime
navn i noark: M108 - arkivperiodeSluttDato
alternative label: Sluttdato ytterår
definition: Sluttdato for informasjonen i arkivdata.

gyldighetsdato fra
type: DatatypeProperty
sub property of: topDataProperty
domain: Tilgang
range: dateTime
definition: Datoen en bestemmelse om tilgang gjelder fra.

gyldighetsdato til
type: DatatypeProperty
sub property of: topDataProperty
domain: Tilgang
range: dateTime
definition: Datoen en bestemmelse om tilgang gjelder til.

identifikatorer
type: DatatypeProperty
sub property of: topDataProperty
definition: Et ord, tall, bokstav, symbol eller en kombinasjon av disse som brukes for å unikt identifisere eller referere til en individuell forekomst av en enhet innenfor et bestemt informasjonsdomene.

konverteringsdato
type: DatatypeProperty
sub property of: topDataProperty
domain: Konvertering
range: dateTime
definition: Datoen konvertering til digitalt format har skjedd.

lakune
type: DatatypeProperty
sub property of: beskrivelse
domain: Arkivdata
range: langString
definition: Status som sier at at det er uffullstendighet i arkivdata.
example: en serie med protokoller har dato fra 1900 og dato til 1930, men det mangler protokoller fra årene 1922 til 1924
example: et register skal omfatte hele data fra hele Norge, men det mangler data fra Finnmark

noark arkivuttrekk id
type: DatatypeProperty
sub property of: identifikatorer
domain: Arkivdata
range: string
navn i noark: M001 - systemID
definition: Entydig identifikator på arkivuttrekk fra et Noark-system.

tidsstempel
type: DatatypeProperty
sub property of: topDataProperty
domain: Thing
range: dateTime

Aktør
type: Class
alternative label: Agent
definition: En fysisk eller juridisk person.
scope note: En aktør kan ha flere ulike roller knyttet til en record resource.

Analog
type: Class
subclass of: Representasjonstype
definition: En kvantitativ variabel som kan endres langs en kontinuerlig (trinnløs) skala.

Arkivdata
type: Class
definition: Utkast til definisjon: en informasjonsmengde som er produsert eller mottatt, og bevart av en aktør som en del av aktørens aktiviteter/handlinger/virke.
example: Arkiv, arkivpakke, arkivserie (og underserie), arkivstykke, arkivmappe, datasett, tekstdokument, pergament, fragment, foto, film og lydopptak.
preferred label: Record Resource @en
scope note: Record sett, record og del av record er record resource.

Avlevering
type: Class
subclass of: Overføringsmetode
definition: Metode for overføring av arkivdata. Råderetten blir overtatt av Nasjonalarkivet.

Beriking
type: Class
subclass of: Årsak til ny generasjon

Deponering
type: Class
subclass of: Overføringsmetode
definition: En metode for overføring av arkivdata der Nasjonalarkivet ikke har råderett, men oppbevarer den respektive arkivdata.

Digital
type: Class
subclass of: Representasjonstype
definition: En informasjonsmengde laget eller lagret med en oppløsning i endelig oppdelte (kvantiserte) trinn, og kan lagres og gjengis uten informasjonstap.

Maskinell transkribering
type: Class
subclass of: Hendelsestype
definition: Omskrive (tekst) fra ett tegnsystem til et annet eller nedtegne ytringer fra et dokument (eller en digital representasjon av et dokument) ved hjelp av maskiner.

Digitisert
type: Class
subclass of: Konverteringsstatus
alternative label: Digitalisering
definition: Arkivdata på et analogt format som er konvertert til digitalt format og de fortsatt bevares analogt.

Dokumenttype
type: Class
navn i noark: M300 - dokumentmedium
comment: Dokument referer her til definisjonen i gjeldende arkivlov og offentlighetslov. Dokument er ei logisk avgrensa informasjonsmengd som er lagra på eit medium for seinare lesing, lyding, framsyning eller overføring.
definition: Hvorvidt arkivdata er tekst, lyd, foto eller film.
example: Strukturert informasjon i en database, ustrukturert informasjon i tekstdokument, film med lyd

Filendring
type: Class
subclass of: Årsak til ny generasjon

Film
type: Class
subclass of: Dokumenttype
definition: Rekke av levende bilder som danner en helhet fotografert med en bildefrekvens som gjør at motivet tilsynelatende beveger seg under fremvisning.

Formål
type: Class
alternative label: Kontekst
comment: Formål kan beskrives veldig overordnet eller mer detaljert, avhengig av hvilke typer arkivdata som beskrives og hva som er tilgjengelig av informasjon om formålet.
definition: Beslutninger, aktiviter og hendelser som hjemler eller er årsaken til at arkivdata skapes.
example: Behandling av søknad om foreldrepenger, etterforskning av økonomisk kriminalitet, avholdelse av styremøter i et aksjeselskap, arrangering av landsleir i speideren eller dokumentasjon av et forskningsprosjekt.

Fotografi
type: Class
subclass of: Dokumenttype
alternative label: Fotografisk bilde; foto
definition: Bilde (lpå papir, negativ eller digitalt), tatt med et kamera.

Fritt tilgjenglig
type: Class
subclass of: Tilgang
definition: Ingen restriksjoner på tilgangen til arkivdata.

Fysisk person
type: Class
subclass of: Aktør
definition: En fysisk person er et menneske.

Generasjon
type: Class
subclass of: Hendelse
definition: En hendelse som skaper en ny generasjon av arkivdata.
scope note: Utløst av hendelsestypene "migrering", "beriking" eller "filendring".

Geografi
type: Class
definition: Geografisk område som er relevant for innholdet i arkivdata.

Hendelse
type: Class
definition: Noe som skjer i tid og rom med arkivdata.
example: Skanning av papir, transkribering av tekst.

Hendelsestype
type: Class
definition: Kategorisering av en hendelse.

Juridisk person
type: Class
subclass of: Aktør
alternative label: Virksomhet
definition: Et rettssubjekt som ikke er en fysisk person.
example: Statlige organer, kommuner, fylkeskommuner, aksjeselskaper, interkommunale selskaper, institusjoner, stiftelser, foreninger og politiske partier.

Konvertering
type: Class
subclass of: Hendelse
definition: Aktiviteten som omformer og overfører arkivdata fra analoge til digitale formater.
example: Skanning av papirdokumenter eller fremkalte foto, og digitalisering av analoge lydbånd.

Konverteringsstatus
type: Class
subclass of: Hendelsestype
definition: Om arkivdata er mediekonvertert, digitalisert eller transkribert.

Lokasjon
type: Class
subclass of: Geografi
definition: Det eller de geografiske stedene en agent er fysisk lokalisert.
example: Arkivverkets elleve ulike lokasjoner.

Lov og forskrift
type: Class
definition: Generelle rettsregler som fastsetter rettigheter og plikter for fysiske eller juridisk personer.
scope note: Lover blir gitt av Stortinget. En forskrift er alltid hjemlet i en lov.

Lovhjemlet skjerming
type: Class
subclass of: Restriksjon
alternative label: Klausulert
definition: Angir at publikums tilgang til arkivdata er hjemlet i lov.

Lyd
type: Class
subclass of: Dokumenttype
definition: Sanseinntrykk oppfattet gjennom øret.

Manuell transkribering
type: Class
subclass of: Hendelsestype
definition: Omskrive (tekst) fra ett tegnsystem til et annet eller nedtegne ytringer fra et dokument (eller en digital representasjon av et dokument) ved hjelp av mennesker.

Maskinvare
type: Class
subclass of: Aktør
definition: Maskinvare er de fysiske delene en datamaskin eller annen teknologisk innretning består av.

Mediekonvertert
type: Class
subclass of: Konverteringsstatus
definition: Arkivdata på et analogt format som er konvertert til digitalt format og analog original destrueres.

Migrering
type: Class
subclass of: Årsak til ny generasjon

Offentlig virksomhet
type: Class
subclass of: Juridisk person
definition: Stat, kommune og fylkeskommune.

Overføring
type: Class
subclass of: Hendelse
definition: En hendelse der arkivdata er overført gjennom avlevering eller deponering.

Overføringsmetode
type: Class
subclass of: Hendelsestype
definition: En hendelsestype for metodikk for overføring av arkivdata.

Privat virksomhet
type: Class
subclass of: Juridisk person
definition: Virksomhet i privat eie og ideelle organisasjoner.

Programvare
type: Class
subclass of: Aktør
alternative label: Software @en
definition: Program som kan brukes av en datamaskin.

Påstand
type: Class
definition: En påstand er en betegnelse om noe som hevdes ubegrunnet eller stedig. En påstand kan gis for alle ting innenfor modellen.
example: En person kommer med påstander om innholdet i arkivdata. Påstanden er forankret i personens akademiske tolkning og arbeid.
example: En person kommer med påstander om innholdet i arkivdata. Påstanden er forankret i personens kulturelle bakgrunn, uten fysiske bevis.

Representasjonstype
type: Class
definition: Om arkivdata har analoge eller digitale representasjoner eller både har digitale og analoge representasjoner.

Restriksjon
type: Class
subclass of: Tilgang
definition: Angir at det er begrensninger for publikums tilgang til arkivdata og hvilke begrensinger som gjelder.

Etter avtale
type: Class
subclass of: Restriksjon
definition: Tilgang etter avtale med råderettshaver.

Språk
type: Class
definition: System av konvensjonelle tegn og symboler som mennesker bruker for å uttrykke seg og for å kommunisere med hverandre.
example: norsk, nord-samisk og engelsk

Standard
type: Class
subclass of: Thing
definition: En felles ”oppskrift” på hvordan noe er laget eller gjennomført.
example: Noark, StandArk, ISO 14721, Record in Context, Premis, METS.

Strukturerte data
type: Class
subclass of: Dokumenttype
definition: Data som som følger en forhåndsbestemt eller sett med regler og som er lagret digitalt.

Ordning
type: Class
definition: Ordning av arkiv, som arkivnøkkel eller arkivkoder.

Tekst
type: Class
subclass of: Dokumenttype
alternative label: Strukturert informasjon
definition: Sammenhengende meningsfyllt følge av trykte eller skrevne ord.

Tilgang
type: Class
definition: Om arkivdata er fritt tilgjengelig eller underlagt restriksjoner eller om tilgang ikke er vurdert.

Ikke vurdert
type: Class
subclass of: Tilgang
definition: Tilgang til arkivdata ikke er vurdert.

Transkribert
type: Class
subclass of: Hendelse
definition: Omskrive (tekst) fra ett tegnsystem til et annet eller nedtegne ytringer fra et dokument (eller en digital representasjon av et dokument).

Årsak til ny generasjon
type: Class
subclass of: Hendelsestype
definition: Samlebetegnelse for årasker til ny generasjon av arkivdata.